Reaction Details
TargetProthrombin
LigandBDBM50288632
Substrate/Competitorn/a
Meas. Tech.ChEBML_208314
Ki 0.040000±n/a nM
Citation Fevig, JMBuriak, JCacciola, JAlexander, RSKettner, CAKnabb, RMPruitt, JRWeber, PCWexler, RR Rational design of boropeptide thrombin inhibitors: beta, beta-dialkyl-phenethylglycine P2 analogs of DuP 714 with greater selectivity over complement factor I and an improved safety profile. Bioorg Med Chem Lett8:301-6 (1999) Prothrombin
Name:Prothrombin
Type:Protein
Mol. Mass.:70029.57
Organism:Homo sapiens (Human)
Description:P00734
Residue:622
BDBM50288632
NameBDBM50288632
Synonyms:Boropeptide | CHEMBL607008
TypeSmall organic molecule
Emp. Form.C21H34BClN6O5
Mol. Mass.496.796
SMILESCl.[#6]-[#6](=O)-[#7]-[#6@H](-[#6]-c1ccccc1)-[#6](=O)-[#7]-1-[#6]-[#6]-[#6]-[#6@H]-1-[#6](=O)-[#7]-[#6@@H](-[#6]-[#6]-[#6]\[#7]=[#6](/[#7])-[#7])-[#5](-[#8])-[#8]