Reaction Details
TargetProthrombin
LigandBDBM50069925
Substrate/Competitorn/a
Meas. Tech.ChEBML_208314
Ki 1.2±n/a nM
Citation Fevig, JMBuriak, JCacciola, JAlexander, RSKettner, CAKnabb, RMPruitt, JRWeber, PCWexler, RR Rational design of boropeptide thrombin inhibitors: beta, beta-dialkyl-phenethylglycine P2 analogs of DuP 714 with greater selectivity over complement factor I and an improved safety profile. Bioorg Med Chem Lett8:301-6 (1999) Prothrombin
Name:Prothrombin
Type:Protein
Mol. Mass.:70029.57
Organism:Homo sapiens (Human)
Description:P00734
Residue:622
BDBM50069925
NameBDBM50069925
Synonyms:Boropeptide analogue | CHEMBL317639
TypeSmall organic molecule
Emp. Form.C26H37BN4O4
Mol. Mass.480.407
SMILESCC(C)(CN(CC(=O)NC(CCCNC=N)B(O)O)C(=O)CCc1ccccc1)c1ccccc1