Reaction Details
TargetProthrombin
LigandBDBM50069937
Substrate/Competitorn/a
Meas. Tech.ChEBML_208314
Ki 0.370000±n/a nM
Citation Fevig, JMBuriak, JCacciola, JAlexander, RSKettner, CAKnabb, RMPruitt, JRWeber, PCWexler, RR Rational design of boropeptide thrombin inhibitors: beta, beta-dialkyl-phenethylglycine P2 analogs of DuP 714 with greater selectivity over complement factor I and an improved safety profile. Bioorg Med Chem Lett8:301-6 (1999) Prothrombin
Name:Prothrombin
Type:Protein
Mol. Mass.:70029.57
Organism:Homo sapiens (Human)
Description:P00734
Residue:622
BDBM50069937
NameBDBM50069937
Synonyms:Boropeptide analogue | CHEMBL102779
TypeSmall organic molecule
Emp. Form.C26H37BN4O4
Mol. Mass.480.407
SMILESCc1cc(C)cc(CCN(CC(=O)NC(CCCNC=N)B(O)O)C(=O)CCc2ccccc2)c1