Reaction Details
TargetCoagulation factor X
LigandBDBM50069923
Substrate/Competitorn/a
Meas. Tech.ChEBML_69662
Ki 300±n/a nM
Citation Fevig, JMBuriak, JCacciola, JAlexander, RSKettner, CAKnabb, RMPruitt, JRWeber, PCWexler, RR Rational design of boropeptide thrombin inhibitors: beta, beta-dialkyl-phenethylglycine P2 analogs of DuP 714 with greater selectivity over complement factor I and an improved safety profile. Bioorg Med Chem Lett8:301-6 (1999) Coagulation factor X
Name:Coagulation factor X
Type:Enzyme
Mol. Mass.:54726.60
Organism:Homo sapiens (Human)
Description:n/a
Residue:488
BDBM50069923
NameBDBM50069923
Synonyms:Boropeptide analogue | CHEMBL104331
TypeSmall organic molecule
Emp. Form.C26H35BN4O4
Mol. Mass.478.391
SMILESOB(O)C(CCCNC=N)NC(=O)CN(CC1(CC1)c1ccccc1)C(=O)CCc1ccccc1