Reaction Details
TargetAlpha-2A adrenergic receptor
LigandBDBM50514727
Substrate/Competitorn/a
Meas. Tech.ChEMBL_1858221 (CHEMBL4358950)
Ki 0.323594±n/a nM
Citation Abás, SRodríguez-Arévalo, SBagán, AGrińán-Ferré, CVasilopoulou, FBrocos-Mosquera, IMuguruza, CPérez, BMolins, ELuque, FJPérez-Lozano, Pde Jonghe, SDaelemans, DNaesens, LBrea, JLoza, MIHernández-Hernández, EGarcía-Sevilla, JAGarcía-Fuster, MJRadan, MDjikic, TNikolic, KPallŕs, MCallado, LFEscolano, C Bicyclic ?-Iminophosphonates as High Affinity Imidazoline I J Med Chem63:3610-3633 (2020) 
 
Alpha-2A adrenergic receptor
Name:Alpha-2A adrenergic receptor
Type:Enzyme
Mol. Mass.:48979.91
Organism:Homo sapiens (Human)
Description:P08913
Residue:465
BDBM50514727
NameBDBM50514727
Synonyms:CHEMBL4483022
TypeSmall organic molecule
Emp. Form.C16H25N2O5P
Mol. Mass.356.3539
SMILESCCOP(=O)(OCC)C1N=CC2C1C(=O)N(C1CCCCC1)C2=O