Reaction Details
TargetAlpha-2A adrenergic receptor
LigandBDBM50514722
Substrate/Competitorn/a
Meas. Tech.ChEMBL_1858221 (CHEMBL4358950)
Ki 0.066069±n/a nM
Citation Abás, SRodríguez-Arévalo, SBagán, AGrińán-Ferré, CVasilopoulou, FBrocos-Mosquera, IMuguruza, CPérez, BMolins, ELuque, FJPérez-Lozano, Pde Jonghe, SDaelemans, DNaesens, LBrea, JLoza, MIHernández-Hernández, EGarcía-Sevilla, JAGarcía-Fuster, MJRadan, MDjikic, TNikolic, KPallŕs, MCallado, LFEscolano, C Bicyclic ?-Iminophosphonates as High Affinity Imidazoline I J Med Chem63:3610-3633 (2020) 
 
Alpha-2A adrenergic receptor
Name:Alpha-2A adrenergic receptor
Type:Enzyme
Mol. Mass.:48979.91
Organism:Homo sapiens (Human)
Description:P08913
Residue:465
BDBM50514722
NameBDBM50514722
Synonyms:CHEMBL4438801
TypeSmall organic molecule
Emp. Form.C22H22N3O7P
Mol. Mass.471.3997
SMILESCCOP(=O)(OCC)C1(N=CC2C1C(=O)N(C2=O)c1cccc(c1)[N+]([O-])=O)c1ccccc1