Reaction Details
Target3-oxo-5-alpha-steroid 4-dehydrogenase 1
LigandBDBM50070049
Substrate/Competitorn/a
Meas. Tech.ChEMBL_205061 (CHEMBL810255)
IC50 6±n/a nM
Citation Smith, ECMcQuaid, LAGoode, RLMcNulty, AMNeubauer, BLRocco, VPAudia, JE Synthesis and 5 alpha-reductase inhibitory activity of 8-substituted benzo[f]quinolinones derived from palladium mediated coupling reactions. Bioorg Med Chem Lett8:395-8 (1999) 3-oxo-5-alpha-steroid 4-dehydrogenase 1
Name:3-oxo-5-alpha-steroid 4-dehydrogenase 1
Type:Enzyme
Mol. Mass.:29472.80
Organism:Homo sapiens (Human)
Description:P18405
Residue:259
BDBM50070049
NameBDBM50070049
Synonyms:(4aR,10bR)-4,10b-Dimethyl-8-((Z)-styryl)-1,4,4a,5,6,10b-hexahydro-2H-benzo[f]quinolin-3-one | CHEMBL129017
TypeSmall organic molecule
Emp. Form.C23H25NO
Mol. Mass.331.4507
SMILESCN1[C@@H]2CCc3cc(\C=C/c4ccccc4)ccc3[C@@]2(C)CCC1=O