Reaction Details
Target3-oxo-5-alpha-steroid 4-dehydrogenase 1
LigandBDBM50070046
Substrate/Competitorn/a
Meas. Tech.ChEBML_204897
IC50 3.4±n/a nM
Citation Smith, ECMcQuaid, LAGoode, RLMcNulty, AMNeubauer, BLRocco, VPAudia, JE Synthesis and 5 alpha-reductase inhibitory activity of 8-substituted benzo[f]quinolinones derived from palladium mediated coupling reactions. Bioorg Med Chem Lett8:395-8 (1999) 3-oxo-5-alpha-steroid 4-dehydrogenase 1
Name:3-oxo-5-alpha-steroid 4-dehydrogenase 1
Type:Enzyme
Mol. Mass.:29472.80
Organism:Homo sapiens (Human)
Description:P18405
Residue:259
BDBM50070046
NameBDBM50070046
Synonyms:(4aR,10bR)-4,10b-Dimethyl-8-((E)-2-quinolin-3-yl-vinyl)-1,4,4a,5,6,10b-hexahydro-2H-benzo[f]quinolin-3-one | CHEMBL130845
TypeSmall organic molecule
Emp. Form.C26H26N2O
Mol. Mass.382.4974
SMILESCN1[C@@H]2CCc3cc(\C=C\c4cnc5ccccc5c4)ccc3[C@@]2(C)CCC1=O