Reaction Details
TargetReverse transcriptase/RNaseH
LigandBDBM50070294
Substrate/Competitorn/a
Meas. Tech.ChEBML_195202
IC50>500000±n/a nM
Citation Goldring, AOBalzarini, JGilbert, IH Design and synthesis of bio-isosteres of thymidine triphosphate. Bioorg Med Chem Lett8:1211-4 (1999) Reverse transcriptase/RNaseH
Name:Reverse transcriptase/RNaseH
Type:PROTEIN
Mol. Mass.:65229.15
Organism:Human immunodeficiency virus 1
Description:ChEMBL_1473730
Residue:566
BDBM50070294
NameBDBM50070294
Synonyms:CHEMBL20165 | N-[3-Hydroxy-5-(5-methyl-2,4-dioxo-3,4-dihydro-2H-pyrimidin-1-yl)-tetrahydro-furan-2-ylmethyl]-2-(4-hydroxy-2-methyl-pyrrolidin-2-yl)-acetamide
TypeSmall organic molecule
Emp. Form.C17H26N4O6
Mol. Mass.382.4115
SMILESCc1cn(C2CC(O)C(CNC(=O)CC3(C)CC(O)CN3)O2)c(=O)[nH]c1=O