Reaction Details
Target5-hydroxytryptamine receptor 1D
LigandBDBM50007407
Substrate/Competitorn/a
Meas. Tech.ChEBML_1715
Ki 6.2±n/a nM
Citation Perez, MJorand-Lebrun, CPauwels, PJPallard, IHalazy, S Dimers of 5HT1 ligands preferentially bind to 5HT1B/1D receptor subtypes. Bioorg Med Chem Lett8:1407-12 (1999) 5-hydroxytryptamine receptor 1D
Name:5-hydroxytryptamine receptor 1D
Type:G Protein-Coupled Receptor (GPCR)
Mol. Mass.:41920.63
Organism:Homo sapiens (Human)
Description:Receptor binding assays were performed using human clone stably expressed in CHO cells.
Residue:377
BDBM50007407
NameBDBM50007407
Synonyms:1-NP 4-Naphthalen-1-yl-piperazin-1-ium | CHEMBL277120
TypeSmall organic molecule
Emp. Form.C14H16N2
Mol. Mass.212.2902
SMILESC1CN(CCN1)c1cccc2ccccc12