Reaction Details
Target5-hydroxytryptamine receptor 1D
LigandBDBM50070406
Substrate/Competitorn/a
Meas. Tech.ChEBML_1715
Ki 0.500000±n/a nM
Citation Perez, MJorand-Lebrun, CPauwels, PJPallard, IHalazy, S Dimers of 5HT1 ligands preferentially bind to 5HT1B/1D receptor subtypes. Bioorg Med Chem Lett8:1407-12 (1999) 5-hydroxytryptamine receptor 1D
Name:5-hydroxytryptamine receptor 1D
Type:G Protein-Coupled Receptor (GPCR)
Mol. Mass.:41920.63
Organism:Homo sapiens (Human)
Description:Receptor binding assays were performed using human clone stably expressed in CHO cells.
Residue:377
BDBM50070406
NameBDBM50070406
Synonyms:2-[3-(2-Amino-ethyl)-1H-indol-5-yloxy]-N-(4-{2-[8-(4-methyl-piperazin-1-yl)-naphthalen-2-yloxy]-acetylamino}-phenyl)-acetamide | CHEMBL282950
TypeSmall organic molecule
Emp. Form.C35H38N6O4
Mol. Mass.606.714
SMILESCN1CCN(CC1)c1cccc2ccc(OCC(=O)Nc3ccc(NC(=O)COc4ccc5[nH]cc(CCN)c5c4)cc3)cc12