Reaction Details
TargetReverse transcriptase/RNaseH
LigandBDBM50070471
Substrate/Competitorn/a
Meas. Tech.ChEBML_197449
IC50 4800±n/a nM
Citation Vig, RMao, CVenkatachalam, TKTuel-Ahlgren, LSudbeck, EAUckun, FM 5-Alkyl-2-[(methylthiomethyl)thio]-6-(benzyl)-pyrimidin-4-(1H)-ones as potent non-nucleoside reverse transcriptase inhibitors of S-DABO series. Bioorg Med Chem Lett8:1461-6 (1999) Reverse transcriptase/RNaseH
Name:Reverse transcriptase/RNaseH
Type:PROTEIN
Mol. Mass.:65229.15
Organism:Human immunodeficiency virus 1
Description:ChEMBL_1473730
Residue:566
BDBM50070471
NameBDBM50070471
Synonyms:6-(3,5-Dimethyl-benzyl)-5-isopropyl-2-methylsulfanylmethylsulfanyl-3H-pyrimidin-4-one | CHEMBL35655
TypeSmall organic molecule
Emp. Form.C18H24N2OS2
Mol. Mass.348.526
SMILESCSCSc1nc(Cc2cc(C)cc(C)c2)c(C(C)C)c(=O)[nH]1