Reaction Details
TargetSubstance-K receptor
LigandBDBM50403654
Substrate/Competitorn/a
Meas. Tech.ChEBML_142729
Ki 0.840000±n/a nM
Citation Jacobs, RTShenvi, ABMauger, RCUlatowski, TGAharony, DBuckner, CK 4-Alkylpiperidines related to SR-48968: potent antagonists of the neurokinin-2 (NK2) receptor. Bioorg Med Chem Lett8:1935-40 (1999) Substance-K receptor
Name:Substance-K receptor
Type:Protein
Mol. Mass.:44455.78
Organism:Homo sapiens (Human)
Description:P21452
Residue:398
BDBM50403654
NameBDBM50403654
Synonyms:CHEMBL2115073
TypeSmall organic molecule
Emp. Form.C28H38Cl2N2O2
Mol. Mass.505.52
SMILESCCC(O)(CC)C1CCN(CC[C@H](CN(C)C(=O)c2ccccc2)c2ccc(Cl)c(Cl)c2)CC1