Reaction Details
TargetSubstance-K receptor
LigandBDBM50071112
Substrate/Competitorn/a
Meas. Tech.ChEBML_142729
Ki 1.75±n/a nM
Citation Jacobs, RTShenvi, ABMauger, RCUlatowski, TGAharony, DBuckner, CK 4-Alkylpiperidines related to SR-48968: potent antagonists of the neurokinin-2 (NK2) receptor. Bioorg Med Chem Lett8:1935-40 (1999) Substance-K receptor
Name:Substance-K receptor
Type:Protein
Mol. Mass.:44455.78
Organism:Homo sapiens (Human)
Description:P21452
Residue:398
BDBM50071112
NameBDBM50071112
Synonyms:CHEMBL56835 SR 48968
TypeSmall organic molecule
Emp. Form.C31H35Cl2N3O2
Mol. Mass.552.535
SMILESCN(CC(CCN1CCC(CC1)(NC(C)=O)c1ccccc1)c1ccc(Cl)c(Cl)c1)C(=O)c1ccccc1