Reaction Details
TargetSubstance-K receptor
LigandBDBM50071120
Substrate/Competitorn/a
Meas. Tech.ChEBML_142729
Ki 3.7±n/a nM
Citation Jacobs, RTShenvi, ABMauger, RCUlatowski, TGAharony, DBuckner, CK 4-Alkylpiperidines related to SR-48968: potent antagonists of the neurokinin-2 (NK2) receptor. Bioorg Med Chem Lett8:1935-40 (1999) Substance-K receptor
Name:Substance-K receptor
Type:Protein
Mol. Mass.:44455.78
Organism:Homo sapiens (Human)
Description:P21452
Residue:398
BDBM50071120
NameBDBM50071120
Synonyms:CHEMBL56788 | N-{2-(3,4-Dichloro-phenyl)-4-[4-(1-hydroxy-butyl)-piperidin-1-yl]-butyl}-N-methyl-benzamide
TypeSmall organic molecule
Emp. Form.C27H36Cl2N2O2
Mol. Mass.491.493
SMILESCCCC(O)C1CCN(CCC(CN(C)C(=O)c2ccccc2)c2ccc(Cl)c(Cl)c2)CC1