Reaction Details
TargetCoagulation factor X
LigandBDBM50071948
Substrate/Competitorn/a
Meas. Tech.ChEMBL_69663 (CHEMBL681855)
Ki 30±n/a nM
Citation Galemmo, RAMaduskuie, TPDominguez, CRossi, KAKnabb, RMWexler, RRStouten, PF The de novo design and synthesis of cyclic urea inhibitors of factor Xa: initial SAR studies. Bioorg Med Chem Lett8:2705-10 (1999) Coagulation factor X
Name:Coagulation factor X
Type:Enzyme
Mol. Mass.:54726.60
Organism:Homo sapiens (Human)
Description:n/a
Residue:488
BDBM50071948
NameBDBM50071948
Synonyms:CHEMBL314535 | Urea analogue
TypeSmall organic molecule
Emp. Form.C26H30N4O3
Mol. Mass.446.5403
SMILESC\C(N)=[N+]1/CCC(C1)Oc1ccc(cc1)C(Cc1ccc2ccc(cc2c1)C(N)=[NH2+])C(O)=O