Reaction Details
TargetProgesterone receptor
LigandBDBM50071992
Substrate/Competitorn/a
Meas. Tech.ChEBML_159728
Ki 29±n/a nM
Citation Hamann, LGWinn, DTPooley, CLTegley, CMWest, SJFarmer, LJZhi, LEdwards, JPMarschke, KBMais, DEGoldman, MEJones, TK Nonsteroidal progesterone receptor antagonists based on a conformationally-restricted subseries of 6-aryl-1,2-dihydro-2,2,4-trimethylquinolines. Bioorg Med Chem Lett8:2731-6 (1999) Progesterone receptor
Name:Progesterone receptor
Type:Protein
Mol. Mass.:98979.52
Organism:Homo sapiens (Human)
Description:P06401
Residue:933
BDBM50071992
NameBDBM50071992
Synonyms:6-Fluoro-2,2,4-trimethyl-1,2-dihydro-indeno[1,2-g]quinolin-10-one CHEMBL90766
TypeSmall organic molecule
Emp. Form.C19H16FNO
Mol. Mass.293.3348
SMILESCC1=CC(C)(C)Nc2cc3C(=O)c4cccc(F)c4-c3cc12