Reaction Details
TargetProgesterone receptor
LigandBDBM50071999
Substrate/Competitorn/a
Meas. Tech.ChEBML_159728
Ki 63±n/a nM
Citation Hamann, LGWinn, DTPooley, CLTegley, CMWest, SJFarmer, LJZhi, LEdwards, JPMarschke, KBMais, DEGoldman, MEJones, TK Nonsteroidal progesterone receptor antagonists based on a conformationally-restricted subseries of 6-aryl-1,2-dihydro-2,2,4-trimethylquinolines. Bioorg Med Chem Lett8:2731-6 (1999) Progesterone receptor
Name:Progesterone receptor
Type:Protein
Mol. Mass.:98979.52
Organism:Homo sapiens (Human)
Description:P06401
Residue:933
BDBM50071999
NameBDBM50071999
Synonyms:CHEMBL327934 | Trifluoro-acetic acid 5,8-difluoro-2,2,4-trimethyl-2,10-dihydro-1H-indeno[1,2-g]quinolin-10-yl ester
TypeSmall organic molecule
Emp. Form.C21H16F5NO2
Mol. Mass.409.3493
SMILESCC1=CC(C)(C)Nc2cc3C(OC(=O)C(F)(F)F)c4cc(F)ccc4-c3c(F)c12