Reaction Details
TargetProgesterone receptor
LigandBDBM50066527
Substrate/Competitorn/a
Meas. Tech.ChEMBL_159728 (CHEMBL766185)
Ki 133±n/a nM
Citation Hamann, LGWinn, DTPooley, CLTegley, CMWest, SJFarmer, LJZhi, LEdwards, JPMarschke, KBMais, DEGoldman, MEJones, TK Nonsteroidal progesterone receptor antagonists based on a conformationally-restricted subseries of 6-aryl-1,2-dihydro-2,2,4-trimethylquinolines. Bioorg Med Chem Lett8:2731-6 (1999) Progesterone receptor
Name:Progesterone receptor
Type:Protein
Mol. Mass.:98979.52
Organism:Homo sapiens (Human)
Description:P06401
Residue:933
BDBM50066527
NameBDBM50066527
Synonyms:2,2,4-Trimethyl-6-phenyl-1,2-dihydro-quinoline CHEMBL93463
TypeSmall organic molecule
Emp. Form.C18H19N
Mol. Mass.249.3502
SMILESCC1=CC(C)(C)Nc2ccc(cc12)-c1ccccc1