Reaction Details
TargetProgesterone receptor
LigandBDBM50072018
Substrate/Competitorn/a
Meas. Tech.ChEMBL_159728 (CHEMBL766185)
Ki 1.5±n/a nM
Citation Hamann, LGWinn, DTPooley, CLTegley, CMWest, SJFarmer, LJZhi, LEdwards, JPMarschke, KBMais, DEGoldman, MEJones, TK Nonsteroidal progesterone receptor antagonists based on a conformationally-restricted subseries of 6-aryl-1,2-dihydro-2,2,4-trimethylquinolines. Bioorg Med Chem Lett8:2731-6 (1999) Progesterone receptor
Name:Progesterone receptor
Type:Protein
Mol. Mass.:98979.52
Organism:Homo sapiens (Human)
Description:P06401
Residue:933
BDBM50072018
NameBDBM50072018
Synonyms:5,8-difluoro-2,2,4-trimethyl-2,10-dihydro-1H-indeno[1,2-g]quinoline | CHEMBL433403
TypeSmall organic molecule
Emp. Form.C19H17F2N
Mol. Mass.297.3418
SMILESCC1=CC(C)(C)Nc2cc3Cc4cc(F)ccc4-c3c(F)c12