Reaction Details
TargetAdenosine receptor A2a
LigandBDBM59206
Substrate/Competitorn/a
Meas. Tech.ChEMBL_1868859 (CHEMBL4369925)
Ki 505±n/a nM
Citation Tosh, DKRao, HBitant, ASalmaso, VMannes, PLieberman, DIVaughan, KLMattison, JARothwell, ACAuchampach, JACiancetta, ALiu, NCui, ZGao, ZGReitman, MLGavrilova, OJacobson, KA Design and in Vivo Characterization of A J Med Chem62:1502-1522 (2019) 
 
Adenosine receptor A2a
Name:Adenosine receptor A2a
Type:G Protein-Coupled Receptor (GPCR)
Mol. Mass.:44716.46
Organism:Homo sapiens (Human)
Description:P29274
Residue:412
BDBM59206
NameBDBM59206
Synonyms:Adenosine analog, 11
TypeSmall organic molecule
Emp. Form.C12H16N6O5
Mol. Mass.324.2926
SMILESNc1ncnc2n(cnc12)[C@@H]1O[C@@H]([C@@H](O)[C@H]1O)C(=O)NCCO