Reaction Details
TargetLactoylglutathione lyase
LigandBDBM50517437
Substrate/Competitorn/a
Meas. Tech.ChEMBL_1869127 (CHEMBL4370193)
IC50 790±n/a nM
Citation Perez, CBarkley-Levenson, AMDick, BLGlatt, PFMartinez, YSiegel, DMomper, JDPalmer, AACohen, SM Metal-Binding Pharmacophore Library Yields the Discovery of a Glyoxalase 1 Inhibitor. J Med Chem62:1609-1625 (2019) 
 
Lactoylglutathione lyase
Name:Lactoylglutathione lyase
Type:Enzyme
Mol. Mass.:20772.95
Organism:Homo sapiens (Human)
Description:Q04760
Residue:184
BDBM50517437
NameBDBM50517437
Synonyms:CHEMBL4514413
TypeSmall organic molecule
Emp. Form.C22H19N3O2S
Mol. Mass.389.47
SMILESO=S(=O)(Nc1ccc(CCc2ccccc2)c2cccnc12)c1ccccn1