Reaction Details
TargetLactoylglutathione lyase
LigandBDBM50517461
Substrate/Competitorn/a
Meas. Tech.ChEMBL_1869127 (CHEMBL4370193)
IC50 1190±n/a nM
Citation Perez, CBarkley-Levenson, AMDick, BLGlatt, PFMartinez, YSiegel, DMomper, JDPalmer, AACohen, SM Metal-Binding Pharmacophore Library Yields the Discovery of a Glyoxalase 1 Inhibitor. J Med Chem62:1609-1625 (2019) 
 
Lactoylglutathione lyase
Name:Lactoylglutathione lyase
Type:Enzyme
Mol. Mass.:20772.95
Organism:Homo sapiens (Human)
Description:Q04760
Residue:184
BDBM50517461
NameBDBM50517461
Synonyms:CHEMBL4575972
TypeSmall organic molecule
Emp. Form.C22H19N3O4S
Mol. Mass.421.469
SMILESCOc1cc(OC)cc(c1)-c1ccc(NS(=O)(=O)c2ccccn2)c2ncccc12