Reaction Details
TargetLactoylglutathione lyase
LigandBDBM50092825
Substrate/Competitorn/a
Meas. Tech.ChEMBL_1869139 (CHEMBL4370205)
Ki 14±n/a nM
Citation Perez, CBarkley-Levenson, AMDick, BLGlatt, PFMartinez, YSiegel, DMomper, JDPalmer, AACohen, SM Metal-Binding Pharmacophore Library Yields the Discovery of a Glyoxalase 1 Inhibitor. J Med Chem62:1609-1625 (2019) 
 
Lactoylglutathione lyase
Name:Lactoylglutathione lyase
Type:Enzyme
Mol. Mass.:20772.95
Organism:Homo sapiens (Human)
Description:Q04760
Residue:184
BDBM50092825
NameBDBM50092825
Synonyms:CHEMBL128935 | S-(N-phenyl-N-hydroxycarbamoyl)glutathione
TypeSmall organic molecule
Emp. Form.C17H22N4O8S
Mol. Mass.442.444
SMILESN[C@@H](CCC(=O)N[C@@H](CSC(=O)N(O)c1ccccc1)C(=O)NCC(O)=O)C(O)=O