Reaction Details
TargetLactoylglutathione lyase
LigandBDBM50517464
Substrate/Competitorn/a
Meas. Tech.ChEMBL_1869139 (CHEMBL4370205)
Ki 230±n/a nM
Citation Perez, CBarkley-Levenson, AMDick, BLGlatt, PFMartinez, YSiegel, DMomper, JDPalmer, AACohen, SM Metal-Binding Pharmacophore Library Yields the Discovery of a Glyoxalase 1 Inhibitor. J Med Chem62:1609-1625 (2019) 
 
Lactoylglutathione lyase
Name:Lactoylglutathione lyase
Type:Enzyme
Mol. Mass.:20772.95
Organism:Homo sapiens (Human)
Description:Q04760
Residue:184
BDBM50517464
NameBDBM50517464
Synonyms:CHEMBL1234300
TypeSmall organic molecule
Emp. Form.C16H16O6
Mol. Mass.304.2946
SMILESCOC(=O)c1c(C)cc(Oc2cc(C)cc(O)c2O)cc1O