Reaction Details
TargetLactoylglutathione lyase
LigandBDBM50517471
Substrate/Competitorn/a
Meas. Tech.ChEMBL_1869127 (CHEMBL4370193)
IC50 720±n/a nM
Citation Perez, CBarkley-Levenson, AMDick, BLGlatt, PFMartinez, YSiegel, DMomper, JDPalmer, AACohen, SM Metal-Binding Pharmacophore Library Yields the Discovery of a Glyoxalase 1 Inhibitor. J Med Chem62:1609-1625 (2019) 
 
Lactoylglutathione lyase
Name:Lactoylglutathione lyase
Type:Enzyme
Mol. Mass.:20772.95
Organism:Homo sapiens (Human)
Description:Q04760
Residue:184
BDBM50517471
NameBDBM50517471
Synonyms:CHEMBL4466017
TypeSmall organic molecule
Emp. Form.C20H14FN3O2S
Mol. Mass.379.407
SMILESFc1ccc(cc1)-c1ccc(NS(=O)(=O)c2ccccn2)c2ncccc12