Reaction Details
TargetLactoylglutathione lyase
LigandBDBM50517488
Substrate/Competitorn/a
Meas. Tech.ChEMBL_1869127 (CHEMBL4370193)
IC50 460±n/a nM
Citation Perez, CBarkley-Levenson, AMDick, BLGlatt, PFMartinez, YSiegel, DMomper, JDPalmer, AACohen, SM Metal-Binding Pharmacophore Library Yields the Discovery of a Glyoxalase 1 Inhibitor. J Med Chem62:1609-1625 (2019) 
 
Lactoylglutathione lyase
Name:Lactoylglutathione lyase
Type:Enzyme
Mol. Mass.:20772.95
Organism:Homo sapiens (Human)
Description:Q04760
Residue:184
BDBM50517488
NameBDBM50517488
Synonyms:CHEMBL4516514
TypeSmall organic molecule
Emp. Form.C24H23N3O4S
Mol. Mass.449.522
SMILESCOc1cc(CCc2cc(NS(=O)(=O)c3ccccn3)c3ncccc3c2)cc(OC)c1