Reaction Details
TargetLactoylglutathione lyase
LigandBDBM50517489
Substrate/Competitorn/a
Meas. Tech.ChEMBL_1869127 (CHEMBL4370193)
IC50 1320±n/a nM
Citation Perez, CBarkley-Levenson, AMDick, BLGlatt, PFMartinez, YSiegel, DMomper, JDPalmer, AACohen, SM Metal-Binding Pharmacophore Library Yields the Discovery of a Glyoxalase 1 Inhibitor. J Med Chem62:1609-1625 (2019) 
 
Lactoylglutathione lyase
Name:Lactoylglutathione lyase
Type:Enzyme
Mol. Mass.:20772.95
Organism:Homo sapiens (Human)
Description:Q04760
Residue:184
BDBM50517489
NameBDBM50517489
Synonyms:CHEMBL4454726
TypeSmall organic molecule
Emp. Form.C22H18FN3O2S
Mol. Mass.407.461
SMILESFc1ccc(CCc2cc(NS(=O)(=O)c3ccccn3)c3ncccc3c2)cc1