Reaction Details
TargetLactoylglutathione lyase
LigandBDBM50402202
Substrate/Competitorn/a
Meas. Tech.ChEMBL_1869139 (CHEMBL4370205)
Ki 11±n/a nM
Citation Perez, CBarkley-Levenson, AMDick, BLGlatt, PFMartinez, YSiegel, DMomper, JDPalmer, AACohen, SM Metal-Binding Pharmacophore Library Yields the Discovery of a Glyoxalase 1 Inhibitor. J Med Chem62:1609-1625 (2019) 
 
Lactoylglutathione lyase
Name:Lactoylglutathione lyase
Type:Enzyme
Mol. Mass.:20772.95
Organism:Homo sapiens (Human)
Description:Q04760
Residue:184
BDBM50402202
NameBDBM50402202
Synonyms:CHEMBL2203964
TypeSmall organic molecule
Emp. Form.C22H21N3O3
Mol. Mass.375.4204
SMILESCOCCCn1ccc2cc(cnc12)-c1cc(cc(=O)n1O)-c1ccccc1