Reaction Details
TargetEpidermal growth factor receptor
LigandBDBM50137185
Substrate/Competitorn/a
Meas. Tech.ChEMBL_1869249 (CHEMBL4370315)
IC50 3.0±n/a nM
Citation Romagnoli, RPrencipe, FOliva, PBaraldi, SBaraldi, PGSchiaffino Ortega, SChayah, MKimatrai Salvador, MLopez-Cara, LCBrancale, AFerla, SHamel, ERonca, RBortolozzi, RMariotto, EMattiuzzo, EViola, G Design, Synthesis, and Biological Evaluation of 6-Substituted Thieno[3,2- d]pyrimidine Analogues as Dual Epidermal Growth Factor Receptor Kinase and Microtubule Inhibitors. J Med Chem62:1274-1290 (2019) 
 
Epidermal growth factor receptor
Name:Epidermal growth factor receptor
Type:Receptor Kinase Domain
Mol. Mass.:134279.59
Organism:Homo sapiens (Human)
Description:P00533
Residue:1210
BDBM50137185
NameBDBM50137185
Synonyms:(1H-Indol-5-yl)-(6-phenyl-thieno[3,2-d]pyrimidin-4-yl)-amine | CHEMBL76432
TypeSmall organic molecule
Emp. Form.C20H14N4S
Mol. Mass.342.417
SMILESN(c1ccc2[nH]ccc2c1)c1ncnc2cc(sc12)-c1ccccc1