Reaction Details
TargetCytochrome P450 2C9
LigandBDBM50517935
Substrate/Competitorn/a
Meas. Tech.ChEMBL_1870100 (CHEMBL4371267)
EC50 34000±n/a nM
Citation Hanson, AMPerera, KLISKim, JPandey, RKSweeney, NLu, XImhoff, AMackinnon, ACWargolet, AJVan Hart, RMFrick, KMDonaldson, WASem, DS A-C Estrogens as Potent and Selective Estrogen Receptor-Beta Agonists (SERBAs) to Enhance Memory Consolidation under Low-Estrogen Conditions. J Med Chem61:4720-4738 (2018) 
 
Cytochrome P450 2C9
Name:Cytochrome P450 2C9
Type:Enzyme
Mol. Mass.:55636.33
Organism:Homo sapiens (Human)
Description:P11712
Residue:490
BDBM50517935
NameBDBM50517935
Synonyms:CHEMBL4526434
TypeSmall organic molecule
Emp. Form.C13H18O2
Mol. Mass.206.2808
SMILESOC[C@H]1CC[C@@H](CC1)c1ccc(O)cc1