Reaction Details
TargetKappa-type opioid receptor
LigandBDBM65817
Substrate/Competitorn/a
Meas. Tech.ChEMBL_1870362 (CHEMBL4371529)
EC50 870±n/a nM
Citation Tan, LYan, WMcCorvy, JDCheng, J Biased Ligands of G Protein-Coupled Receptors (GPCRs): Structure-Functional Selectivity Relationships (SFSRs) and Therapeutic Potential. J Med Chem61:9841-9878 (2018) 
 
Kappa-type opioid receptor
Name:Kappa-type opioid receptor
Type:G Protein-Coupled Receptor (GPCR)
Mol. Mass.:42648.76
Organism:Homo sapiens (Human)
Description:P41145
Residue:380
BDBM65817
NameBDBM65817
Synonyms:2-[5-[(3,4-dichlorobenzyl)thio]-4-(2-furfuryl)-1,2,4-triazol-3-yl]pyridine 2-[5-[(3,4-dichlorophenyl)methylthio]-4-(2-furanylmethyl)-1,2,4-triazol-3-yl]pyridine KUC103893N cid_44601470
TypeSmall organic molecule
Emp. Form.C19H14Cl2N4OS
Mol. Mass.417.312
SMILESClc1ccc(CSc2nnc(-c3ccccn3)n2Cc2ccco2)cc1Cl