Reaction Details
TargetCannabinoid receptor 1
LigandBDBM29080
Substrate/Competitorn/a
Meas. Tech.ChEMBL_46802 (CHEMBL659689)
Ki 20000±n/a nM
Citation Lin, SKhanolkar, ADFan, PGoutopoulos, AQin, CPapahadjis, DMakriyannis, A Novel analogues of arachidonylethanolamide (anandamide): affinities for the CB1 and CB2 cannabinoid receptors and metabolic stability. J Med Chem41:5353-61 (1999) 
 
Cannabinoid receptor 1
Name:Cannabinoid receptor 1
Type:G Protein-Coupled Receptor (GPCR)
Mol. Mass.:52856.55
Organism:Rattus norvegicus (rat)
Description:P20272
Residue:473
BDBM29080
NameBDBM29080
Synonyms:CHEMBL280065 Oleamide MEA Oleoylethanolamide (OEA)
Typen/a
Emp. Form.C20H39NO2
Mol. Mass.325.5292
SMILESCCCCCCCC\C=C/CCCCCCCC(=O)NCCO