Reaction Details
TargetCannabinoid receptor 2
LigandBDBM29080
Substrate/Competitorn/a
Meas. Tech.ChEMBL_46998 (CHEMBL658967)
Ki 31000±n/a nM
Citation Lin, SKhanolkar, ADFan, PGoutopoulos, AQin, CPapahadjis, DMakriyannis, A Novel analogues of arachidonylethanolamide (anandamide): affinities for the CB1 and CB2 cannabinoid receptors and metabolic stability. J Med Chem41:5353-61 (1999) 
 
Cannabinoid receptor 2
Name:Cannabinoid receptor 2
Type:Enzyme Catalytic Domain
Mol. Mass.:38220.43
Organism:MOUSE
Description:P47936
Residue:347
BDBM29080
NameBDBM29080
Synonyms:CHEMBL280065 Oleamide MEA Oleoylethanolamide (OEA)
Typen/a
Emp. Form.C20H39NO2
Mol. Mass.325.5292
SMILESCCCCCCCC\C=C/CCCCCCCC(=O)NCCO