Reaction Details
TargetSerine protease 1
LigandBDBM50038002
Substrate/Competitorn/a
Meas. Tech.ChEMBL_212168 (CHEMBL819016)
Ki 39000±n/a nM
Citation Renatus, MBode, WHuber, RStürzebecher, JStubbs, MT Structural and functional analyses of benzamidine-based inhibitors in complex with trypsin: implications for the inhibition of factor Xa, tPA, and urokinase. J Med Chem41:5445-56 (1999) 
 
Serine protease 1
Name:Serine protease 1
Type:Enzyme
Mol. Mass.:25790.52
Organism:Bos taurus (bovine)
Description:P00760
Residue:246
BDBM50038002
NameBDBM50038002
Synonyms:Benzamidine (Protonated) CHEMBL537204 | benzamidine
TypeSmall organic molecule
Emp. Form.C7H8N2
Mol. Mass.120.1518
SMILESNC(=N)c1ccccc1