Reaction Details
TargetProthrombin
LigandBDBM50060049
Substrate/Competitorn/a
Meas. Tech.ChEMBL_210594 (CHEMBL816561)
Ki 65±n/a nM
Citation Renatus, MBode, WHuber, RStürzebecher, JStubbs, MT Structural and functional analyses of benzamidine-based inhibitors in complex with trypsin: implications for the inhibition of factor Xa, tPA, and urokinase. J Med Chem41:5445-56 (1999) 
 
Prothrombin
Name:Prothrombin
Type:Enzyme
Mol. Mass.:70502.73
Organism:Bos taurus (Bovine)
Description:P00735
Residue:625
BDBM50060049
NameBDBM50060049
Synonyms:3-[2-(Naphthalene-2-sulfonylamino)-3-oxo-3-piperidin-1-yl-propyl]-benzamidine | CHEMBL104241
TypeSmall organic molecule
Emp. Form.C25H28N4O3S
Mol. Mass.464.58
SMILESNC(=N)c1cccc(CC(NS(=O)(=O)c2ccc3ccccc3c2)C(=O)N2CCCCC2)c1