Reaction Details
TargetGag-Pol polyprotein [489-587]
LigandBDBM50073247
Substrate/Competitorn/a
Meas. Tech.ChEBML_157700
Ki 0.680000±n/a nM
Citation Randad, RSLubkowska, LEissenstat, MAGulnik, SVYu, BBhat, TNClanton, DJHouse, TStinson, SFErickson, JW Unsymmetric nonpeptidic HIV protease inhibitors containing anthranilamide as a P2' ligand. Bioorg Med Chem Lett8:3537-42 (1999) Gag-Pol polyprotein [489-587]
Name:Gag-Pol polyprotein [489-587]
Type:Enzyme Subunit
Mol. Mass.:10781.16
Organism:Human immunodeficiency virus type 1
Description:P04585[489-587]
Residue:99
BDBM50073247
NameBDBM50073247
Synonyms:CHEMBL118513 | {2-[(1S,2S,4S)-1-Benzyl-2-hydroxy-4-(3-hydroxy-2-methyl-benzoylamino)-5-phenyl-pentylcarbamoyl]-phenyl}-carbamic acid pyridin-2-ylmethyl ester
TypeSmall organic molecule
Emp. Form.C40H40N4O6
Mol. Mass.672.7688
SMILESCc1c(O)cccc1C(=O)N[C@H](C[C@H](O)[C@H](Cc1ccccc1)NC(=O)c1ccccc1NC(=O)OCc1ccccn1)Cc1ccccc1