Reaction Details
TargetGag-Pol polyprotein [489-587]
LigandBDBM50073253
Substrate/Competitorn/a
Meas. Tech.ChEBML_157700
Ki 0.030000±n/a nM
Citation Randad, RSLubkowska, LEissenstat, MAGulnik, SVYu, BBhat, TNClanton, DJHouse, TStinson, SFErickson, JW Unsymmetric nonpeptidic HIV protease inhibitors containing anthranilamide as a P2' ligand. Bioorg Med Chem Lett8:3537-42 (1999) Gag-Pol polyprotein [489-587]
Name:Gag-Pol polyprotein [489-587]
Type:Enzyme Subunit
Mol. Mass.:10781.16
Organism:Human immunodeficiency virus type 1
Description:P04585[489-587]
Residue:99
BDBM50073253
NameBDBM50073253
Synonyms:CHEMBL278935 | {2-[(1S,3S,4S)-1-Benzyl-3-hydroxy-5-phenyl-4-(thiazol-5-ylmethoxycarbonylamino)-pentylcarbamoyl]-phenyl}-carbamic acid pyridin-2-ylmethyl ester
TypeSmall organic molecule
Emp. Form.C37H37N5O6S
Mol. Mass.679.785
SMILESO[C@@H](C[C@H](Cc1ccccc1)NC(=O)c1ccccc1NC(=O)OCc1ccccn1)[C@H](Cc1ccccc1)NC(=O)OCc1cncs1