Reaction Details
TargetGag-Pol polyprotein [489-587]
LigandBDBM50073254
Substrate/Competitorn/a
Meas. Tech.ChEBML_157700
Ki 0.070000±n/a nM
Citation Randad, RSLubkowska, LEissenstat, MAGulnik, SVYu, BBhat, TNClanton, DJHouse, TStinson, SFErickson, JW Unsymmetric nonpeptidic HIV protease inhibitors containing anthranilamide as a P2' ligand. Bioorg Med Chem Lett8:3537-42 (1999) Gag-Pol polyprotein [489-587]
Name:Gag-Pol polyprotein [489-587]
Type:Enzyme Subunit
Mol. Mass.:10781.16
Organism:Human immunodeficiency virus type 1
Description:P04585[489-587]
Residue:99
BDBM50073254
NameBDBM50073254
Synonyms:Anthranilamide derivative | CHEMBL408110
TypeSmall organic molecule
Emp. Form.C46H44N6O8
Mol. Mass.808.877
SMILESO[C@@H]([C@H](Cc1ccccc1)NC(=O)c1ccccc1NC(=O)OCc1ccccn1)[C@H](O)[C@H](Cc1ccccc1)NC(=O)c1ccccc1NC(=O)OCc1ccccn1