Reaction Details
TargetGag-Pol polyprotein [489-587]
LigandBDBM50073266
Substrate/Competitorn/a
Meas. Tech.ChEBML_157700
Ki 0.020000±n/a nM
Citation Randad, RSLubkowska, LEissenstat, MAGulnik, SVYu, BBhat, TNClanton, DJHouse, TStinson, SFErickson, JW Unsymmetric nonpeptidic HIV protease inhibitors containing anthranilamide as a P2' ligand. Bioorg Med Chem Lett8:3537-42 (1999) Gag-Pol polyprotein [489-587]
Name:Gag-Pol polyprotein [489-587]
Type:Enzyme Subunit
Mol. Mass.:10781.16
Organism:Human immunodeficiency virus type 1
Description:P04585[489-587]
Residue:99
BDBM50073266
NameBDBM50073266
Synonyms:CHEMBL119898 | {2-[(1S,3S,4S)-1-Benzyl-4-((2S,3S)-2-ethoxycarbonylamino-3-methyl-pentanoylamino)-3-hydroxy-5-phenyl-pentylcarbamoyl]-phenyl}-carbamic acid pyridin-2-ylmethyl ester
TypeSmall organic molecule
Emp. Form.C41H49N5O7
Mol. Mass.723.8571
SMILESCCOC(=O)N[C@@H]([C@@H](C)CC)C(=O)N[C@@H](Cc1ccccc1)[C@@H](O)C[C@H](Cc1ccccc1)NC(=O)c1ccccc1NC(=O)OCc1ccccn1