Reaction Details
TargetGag-Pol polyprotein [489-587]
LigandBDBM50073265
Substrate/Competitorn/a
Meas. Tech.ChEBML_157700
Ki 0.070000±n/a nM
Citation Randad, RSLubkowska, LEissenstat, MAGulnik, SVYu, BBhat, TNClanton, DJHouse, TStinson, SFErickson, JW Unsymmetric nonpeptidic HIV protease inhibitors containing anthranilamide as a P2' ligand. Bioorg Med Chem Lett8:3537-42 (1999) Gag-Pol polyprotein [489-587]
Name:Gag-Pol polyprotein [489-587]
Type:Enzyme Subunit
Mol. Mass.:10781.16
Organism:Human immunodeficiency virus type 1
Description:P04585[489-587]
Residue:99
BDBM50073265
NameBDBM50073265
Synonyms:(2-{(1S,2S,3R,4S)-1-Benzyl-2,3-dihydroxy-5-phenyl-4-[(R)-(tetrahydro-furan-3-yl)oxycarbonylamino]-pentylcarbamoyl}-phenyl)-carbamic acid pyridin-2-ylmethyl ester | CHEMBL120141
TypeSmall organic molecule
Emp. Form.C37H40N4O8
Mol. Mass.668.7355
SMILESO[C@H]([C@H](Cc1ccccc1)NC(=O)O[C@@H]1CCOC1)[C@@H](O)[C@H](Cc1ccccc1)NC(=O)c1ccccc1NC(=O)OCc1ccccn1