Reaction Details
TargetGag-Pol polyprotein [489-587]
LigandBDBM1682
Substrate/Competitorn/a
Meas. Tech.ChEBML_157702
Ki 6±n/a nM
Citation Han, WPelletier, JCHodge, CN Tricyclic ureas: a new class of HIV-1 protease inhibitors. Bioorg Med Chem Lett8:3615-20 (1999) Gag-Pol polyprotein [489-587]
Name:Gag-Pol polyprotein [489-587]
Type:Enzyme Subunit
Mol. Mass.:10781.16
Organism:Human immunodeficiency virus type 1
Description:P04585[489-587]
Residue:99
BDBM1682
NameBDBM1682
Synonyms:(4R,5S,6R,7R)-1,3,4,7-tetrabenzyl-5,6-dihydroxy-1,3-diazepan-2-one CHEMBL120610 | Cyclic Urea diastereomer 24
TypeSmall organic molecule
Emp. Form.C33H34N2O3
Mol. Mass.506.6347
SMILESO[C@H]1[C@@H](O)[C@@H](Cc2ccccc2)N(Cc2ccccc2)C(=O)N(Cc2ccccc2)[C@@H]1Cc1ccccc1