Reaction Details
TargetGag-Pol polyprotein [489-587]
LigandBDBM50073347
Substrate/Competitorn/a
Meas. Tech.ChEBML_157537
Ki 38±n/a nM
Citation Baker, CTSalituro, FGCourt, JJDeininger, DDKim, EELi, BNovak, PMRao, BGPazhanisamy, SSchairer, WCTung, RD Design, synthesis, and conformational analysis of a novel series of HIV protease inhibitors. Bioorg Med Chem Lett8:3631-6 (1999) Gag-Pol polyprotein [489-587]
Name:Gag-Pol polyprotein [489-587]
Type:Enzyme Subunit
Mol. Mass.:10781.16
Organism:Human immunodeficiency virus type 1
Description:P04585[489-587]
Residue:99
BDBM50073347
NameBDBM50073347
Synonyms:CHEMBL331105 | {(S)-3-[Cyclopentylmethyl-(4-methoxy-benzenesulfonyl)-amino]-2-hydroxy-propyl}-phenethyl-carbamic acid 1,1-dioxo-tetrahydro-1lambda*6*-thiophen-3-yl ester
TypeSmall organic molecule
Emp. Form.C29H40N2O8S2
Mol. Mass.608.767
SMILESCOc1ccc(cc1)S(=O)(=O)N(C[C@@H](O)CN(CCc1ccccc1)C(=O)OC1CCS(=O)(=O)C1)CC1CCCC1