Reaction Details
TargetGag-Pol polyprotein [489-587]
LigandBDBM50073362
Substrate/Competitorn/a
Meas. Tech.ChEMBL_157537 (CHEMBL764922)
Ki 43±n/a nM
Citation Baker, CTSalituro, FGCourt, JJDeininger, DDKim, EELi, BNovak, PMRao, BGPazhanisamy, SSchairer, WCTung, RD Design, synthesis, and conformational analysis of a novel series of HIV protease inhibitors. Bioorg Med Chem Lett8:3631-6 (1999) Gag-Pol polyprotein [489-587]
Name:Gag-Pol polyprotein [489-587]
Type:Enzyme Subunit
Mol. Mass.:10781.16
Organism:Human immunodeficiency virus type 1
Description:P04585[489-587]
Residue:99
BDBM50073362
NameBDBM50073362
Synonyms:CHEMBL264550 | N-Cyclopentylmethyl-N-{(S)-2-hydroxy-3-[3-((1S,2R)-2-hydroxy-indan-1-yl)-1-phenethyl-ureido]-propyl}-4-methoxy-benzenesulfonamide
TypeSmall organic molecule
Emp. Form.C34H43N3O6S
Mol. Mass.621.787
SMILESCOc1ccc(cc1)S(=O)(=O)N(C[C@@H](O)CN(CCc1ccccc1)C(=O)N[C@@H]1[C@H](O)Cc2ccccc12)CC1CCCC1