Reaction Details
TargetGag-Pol polyprotein [489-587]
LigandBDBM50073365
Substrate/Competitorn/a
Meas. Tech.ChEBML_157537
Ki 7±n/a nM
Citation Baker, CTSalituro, FGCourt, JJDeininger, DDKim, EELi, BNovak, PMRao, BGPazhanisamy, SSchairer, WCTung, RD Design, synthesis, and conformational analysis of a novel series of HIV protease inhibitors. Bioorg Med Chem Lett8:3631-6 (1999) Gag-Pol polyprotein [489-587]
Name:Gag-Pol polyprotein [489-587]
Type:Enzyme Subunit
Mol. Mass.:10781.16
Organism:Human immunodeficiency virus type 1
Description:P04585[489-587]
Residue:99
BDBM50073365
NameBDBM50073365
Synonyms:(S)-2-(3-{(R)-3-[Cyclopentylmethyl-(4-methoxy-phenylsulfonyl)-amino]-2-hydroxy-propyl}-3-phenethyl-ureido)-3-methyl-butyric acid benzyl ester | CHEMBL124003
TypeSmall organic molecule
Emp. Form.C37H49N3O7S
Mol. Mass.679.866
SMILESCOc1ccc(cc1)S(=O)(=O)N(C[C@@H](O)CN(CCc1ccccc1)C(=O)N[C@@H](C(C)C)C(=O)OCc1ccccc1)CC1CCCC1