Reaction Details
TargetHistone deacetylase 5
LigandBDBM19410
Substrate/Competitorn/a
Meas. Tech.ChEMBL_1875451 (CHEMBL4376740)
IC50>1000±n/a nM
Citation Shouksmith, AEGawel, JMNawar, NSina, DRaouf, YSBukhari, SHe, LJohns, AEManaswiyoungkul, POlaoye, OOCabral, ADSedighi, Ade Araujo, EDGunning, PT Class I/IIb-Selective HDAC Inhibitor Exhibits Oral Bioavailability and Therapeutic Efficacy in Acute Myeloid Leukemia. ACS Med Chem Lett11:56-64 (2020) 
 
Histone deacetylase 5
Name:Histone deacetylase 5
Type:Enzyme
Mol. Mass.:121968.61
Organism:Homo sapiens (Human)
Description:Q9UQL6
Residue:1122
BDBM19410
NameBDBM19410
Synonyms:CHEMBL27759 US11377423, MS-275 US9265734, MS-275 benzamide-type inhibitor, 3 | pyridin-3-ylmethyl N-({4-[(2-aminophenyl)carbamoyl]phenyl}methyl)carbamate
TypeSmall organic molecule
Emp. Form.C21H20N4O3
Mol. Mass.376.4085
SMILESNc1ccccc1NC(=O)c1ccc(CNC(=O)OCc2cccnc2)cc1