Reaction Details
TargetAlpha-1B adrenergic receptor
LigandBDBM50073570
Substrate/Competitorn/a
Meas. Tech.ChEMBL_32304 (CHEMBL646250)
Ki 0.46±n/a nM
Citation Leonardi, AMotta, GBoi, CTesta, RPoggesi, EDe Benedetti, PGMenziani, MC Synthesis, pharmacological evaluation, and structure-activity relationship and quantitative structure-activity relationship studies on novel derivatives of 2,4-diamino-6,7-dimethoxyquinazoline alpha1-adrenoceptor antagonists. J Med Chem42:427-37 (1999) 
 
Alpha-1B adrenergic receptor
Name:Alpha-1B adrenergic receptor
Type:Enzyme
Mol. Mass.:56862.13
Organism:Homo sapiens (Human)
Description:P35368
Residue:520
BDBM50073570
NameBDBM50073570
Synonyms:2-(4-Furan-2-yl-piperazin-1-yl)-6,7-dimethoxy-quinazolin-4-ylamine | CHEMBL137598
TypeSmall organic molecule
Emp. Form.C18H21N5O3
Mol. Mass.355.391
SMILESCOc1cc2nc(nc(N)c2cc1OC)N1CCN(CC1)c1ccco1