Reaction Details
Target5-hydroxytryptamine receptor 1D
LigandBDBM50073681
Substrate/Competitorn/a
Meas. Tech.ChEMBL_1728 (CHEMBL616933)
Ki 1.7±n/a nM
Citation Xu, YCSchaus, JMWalker, CKrushinski, JAdham, NZgombick, JMLiang, SXKohlman, DTAudia, JE N-Methyl-5-tert-butyltryptamine: A novel, highly potent 5-HT1D receptor agonist. J Med Chem42:526-31 (1999) 
 
5-hydroxytryptamine receptor 1D
Name:5-hydroxytryptamine receptor 1D
Type:G Protein-Coupled Receptor (GPCR)
Mol. Mass.:41920.63
Organism:Homo sapiens (Human)
Description:Receptor binding assays were performed using human clone stably expressed in CHO cells.
Residue:377
BDBM50073681
NameBDBM50073681
Synonyms:2-(5-Cyclopentyl-1H-indol-3-yl)-ethylamine | CHEMBL151502
TypeSmall organic molecule
Emp. Form.C15H20N2
Mol. Mass.228.3327
SMILESNCCc1c[nH]c2ccc(cc12)C1CCCC1