Reaction Details
Target5-hydroxytryptamine receptor 1A
LigandBDBM50073682
Substrate/Competitorn/a
Meas. Tech.ChEMBL_951 (CHEMBL616130)
Ki 45±n/a nM
Citation Xu, YCSchaus, JMWalker, CKrushinski, JAdham, NZgombick, JMLiang, SXKohlman, DTAudia, JE N-Methyl-5-tert-butyltryptamine: A novel, highly potent 5-HT1D receptor agonist. J Med Chem42:526-31 (1999) 
 
5-hydroxytryptamine receptor 1A
Name:5-hydroxytryptamine receptor 1A
Type:n/a
Mol. Mass.:46122.49
Organism:Homo sapiens (Human)
Description:n/a
Residue:422
BDBM50073682
NameBDBM50073682
Synonyms:CHEMBL1278 N-methyl-2-[3-(1-methyl-4-piperidyl)-1H-indol-5-yl]-ethanesulfonamide NARATRIPTAN
TypeSmall organic molecule
Emp. Form.C17H25N3O2S
Mol. Mass.335.464
SMILESCNS(=O)(=O)CCc1ccc2[nH]cc(C3CCN(C)CC3)c2c1