Reaction Details
Target5-hydroxytryptamine receptor 1D
LigandBDBM50049086
Substrate/Competitorn/a
Meas. Tech.ChEMBL_1728 (CHEMBL616933)
Ki 3.7±n/a nM
Citation Xu, YCSchaus, JMWalker, CKrushinski, JAdham, NZgombick, JMLiang, SXKohlman, DTAudia, JE N-Methyl-5-tert-butyltryptamine: A novel, highly potent 5-HT1D receptor agonist. J Med Chem42:526-31 (1999) 
 
5-hydroxytryptamine receptor 1D
Name:5-hydroxytryptamine receptor 1D
Type:G Protein-Coupled Receptor (GPCR)
Mol. Mass.:41920.63
Organism:Homo sapiens (Human)
Description:Receptor binding assays were performed using human clone stably expressed in CHO cells.
Residue:377
BDBM50049086
NameBDBM50049086
Synonyms:2-(5-Ethyl-1H-indol-3-yl)-ethylamine | CHEMBL107511
TypeSmall organic molecule
Emp. Form.C12H16N2
Mol. Mass.188.2688
SMILESCCc1ccc2[nH]cc(CCN)c2c1